Target
Dual specificity tyrosine-phosphorylation-regulated kinase 1A
Ligand
BDBM50434338
Substrate
Meas. Tech.
ChEMBL_961005 (CHEMBL2388921)
IC50
1.1±n/a nM
Citation
 Rosse, G Tricyclic Pyrimidines As Inhibitors of DYRK1A/DYRK1B As Potential Treatment for Down's Syndrome or Alzheimer's Disease. ACS Med Chem Lett 4:502-3 (2013)  
Target
Name:
Dual specificity tyrosine-phosphorylation-regulated kinase 1A
Synonyms:
DYR1A_HUMAN DYRK1A Dual specificity YAK1-related kinase 1A (Dyrk1A) Dual-specificity tyrosine-phosphorylation regulated kinase 1A HP86 MNBH
Type:
Enzyme
Mol. Mass.:
85616.61
Organism:
Homo sapiens (Human)
Description:
Q13627
Residue:
763
  
Inhibitor
Name:
BDBM50434338
Synonyms:
CHEMBL2386762 | US9446044, 56
Type:
Small organic molecule
Emp. Form.:
C17H12ClN5OS
Mol. Mass.:
369.828
SMILES:
COC(=N)c1nc2ccc3ncnc(Nc4ccc(Cl)cc4)c3c2s1
: