Target
Renin
Ligand
BDBM50434424
Substrate
Meas. Tech.
ChEMBL_962065 (CHEMBL2388033)
IC50
7.3±n/a nM
Citation
 Nakamura, YFujimoto, TOgawa, YNamiki, HSuzuki, SAsano, MSugita, CMochizuki, AMiyazaki, STamaki, KNagai, YInoue, SNagayama, TKato, MChiba, KTakasuna, KNishi, T Lead optimization of 5-amino-6-(2,2-dimethyl-5-oxo-4-phenylpiperazin-1-yl)-4-hydroxyhexanamides to reduce a cardiac safety issue: discovery of DS-8108b, an orally active renin inhibitor. Bioorg Med Chem 21:3175-96 (2013)  
Target
Name:
Renin
Synonyms:
Angiotensinogenase RENI_MACFA
Type:
PROTEIN
Mol. Mass.:
45012.96
Organism:
Macaca fascicularis
Description:
ChEMBL_979177
Residue:
406
  
Inhibitor
Name:
BDBM50434424
Synonyms:
CHEMBL2387568
Type:
Small organic molecule
Emp. Form.:
C29H43ClN4O4
Mol. Mass.:
547.129
SMILES:
C[C@H](C[C@H](O)[C@@H](N)CN1CC(=O)N(CC1(C)C)c1ccccc1Cl)C(=O)N[C@H]1C2CC3CC1C[C@](O)(C3)C2
: