Target
Transient receptor potential cation channel subfamily V member 6
Ligand
BDBM50434565
Substrate
Meas. Tech.
ChEMBL_962122 (CHEMBL2388391)
IC50
24500±n/a nM
Citation
 Hofer, AKovacs, GZappatini, ALeuenberger, MHediger, MALochner, M Design, synthesis and pharmacological characterization of analogs of 2-aminoethyl diphenylborinate (2-APB), a known store-operated calcium channel blocker, for inhibition of TRPV6-mediated calcium transport. Bioorg Med Chem 21:3202-13 (2013)  
Target
Name:
Transient receptor potential cation channel subfamily V member 6
Synonyms:
CaT-L CaT1 ECAC2 TRPV6 | TRPV6_HUMAN
Type:
PROTEIN
Mol. Mass.:
87295.84
Organism:
Homo sapiens (Human)
Description:
ChEMBL_103784
Residue:
765
  
Inhibitor
Name:
BDBM50434565
Synonyms:
CHEMBL2385995
Type:
Small organic molecule
Emp. Form.:
C14H16BNO
Mol. Mass.:
225.094
SMILES:
C1CO[B-]([NH2+]1)(c1ccccc1)c1ccccc1
: