Target
Androgen receptor
Ligand
BDBM50434568
Substrate
Meas. Tech.
ChEMBL_962459 (CHEMBL2390352)
IC50
330±n/a nM
Citation
 Tamura, HYoshioka, MHasegawa, MHosoda, AMatsugi, MAkamatsu, M The systematic structure-activity relationship to predict how flavones bind to human androgen receptor for their antagonistic activity. Bioorg Med Chem 21:2968-74 (2013)  
Target
Name:
Androgen receptor
Synonyms:
ANDR_HUMAN Androgen Receptor Androgen receptor/Baculoviral IAP repeat-containing protein 2 Dihydrotestosterone receptor Nuclear receptor subfamily 3 group C member 4
Type:
Receptor
Mol. Mass.:
99185.27
Organism:
Homo sapiens (Human)
Description:
CHO cells were stably transfected with human AR gene.
Residue:
920
  
Inhibitor
Name:
BDBM50434568
Synonyms:
CHEMBL2386393
Type:
Small organic molecule
Emp. Form.:
C15H9FO3
Mol. Mass.:
256.2286
SMILES:
Oc1cccc2oc(cc(=O)c12)-c1ccc(F)cc1
: