Target
Aurora kinase A
Ligand
BDBM50434622
Substrate
Meas. Tech.
ChEMBL_963008 (CHEMBL2390016)
IC50
69±n/a nM
Citation
 Lin, WHHsu, JTHsieh, SYChen, CTSong, JSYen, SCHsu, TLu, CTChen, CHChou, LHYang, YNChiu, CHChen, CPTseng, YJYen, KJYeh, CFChao, YSYeh, TKJiaang, WT Discovery of 3-phenyl-1H-5-pyrazolylamine derivatives containing a urea pharmacophore as potent and efficacious inhibitors of FMS-like tyrosine kinase-3 (FLT3). Bioorg Med Chem 21:2856-67 (2013)  
Target
Name:
Aurora kinase A
Synonyms:
AIK ARK1 AURKA AYK1 Aurora kinase A (AURA) Aurora kinase A (Aurora A) Aurora-related kinase 1 BTAK Breast-tumor-amplified kinase STK15 Serine/threonine kinase 15 Serine/threonine-protein kinase aurora A hARK1
Type:
Serine/threonine-protein kinase
Mol. Mass.:
45830.98
Organism:
Homo sapiens (Human)
Description:
O14965
Residue:
403
  
Inhibitor
Name:
BDBM50434622
Synonyms:
CHEMBL2386795
Type:
Small organic molecule
Emp. Form.:
C31H37N7O5
Mol. Mass.:
587.6694
SMILES:
Cc1cc(ccc1NC(=O)Nc1cc(on1)C(C)(C)C)-c1cc(NC(=O)c2ccc(OCCN3CCOCC3)cc2)[nH]n1
: