Target
Nociceptin receptor
Ligand
BDBM50434637
Substrate
Meas. Tech.
ChEMBL_960443 (CHEMBL2389094)
Ki
213±n/a nM
Citation
 Zaveri, NTJiang, FOlsen, CPolgar, WEToll, L Designing bifunctional NOP receptor-mu opioid receptor ligands from NOP receptor-selective scaffolds. Part I. Bioorg Med Chem Lett 23:3308-13 (2013)  
Target
Name:
Nociceptin receptor
Synonyms:
KOR-3 Mu-type opioid receptor (Mu) Nociceptin Receptor (ORL1 Receptor) Nociceptin receptor (ORL-1) Nociceptin/Orphanin FQ, NOP receptor OPIATE ORL-1 OPRL1 protein ORL1 Opioid receptor like-1 Orphanin FQ receptor (ORL1) | P41146
Type:
G Protein-Coupled Receptor (GPCR)
Mol. Mass.:
40702.87
Organism:
Homo sapiens (Human)
Description:
P41146
Residue:
370
  
Inhibitor
Name:
BDBM50434637
Synonyms:
CHEMBL2387190
Type:
Small organic molecule
Emp. Form.:
C20H28N2O
Mol. Mass.:
312.4491
SMILES:
O=C1Cc2ccccc2N1C1CCN(CC2CCCCC2)CC1
: