Target
Serine/threonine-protein kinase pim-1
Ligand
BDBM50434650
Substrate
Meas. Tech.
ChEMBL_960801 (CHEMBL2388109)
Ki
0.040000±n/a nM
Citation
 Wang, XMagnuson, SPastor, RFan, EHu, HTsui, VDeng, WMurray, JSteffek, MWallweber, HMoffat, JDrummond, JChan, GHarstad, EEbens, AJ Discovery of novel pyrazolo[1,5-a]pyrimidines as potent pan-Pim inhibitors by structure- and property-based drug design. Bioorg Med Chem Lett 23:3149-53 (2013)  
Target
Name:
Serine/threonine-protein kinase pim-1
Synonyms:
PIM-1 Kinase PIM1_HUMAN Serine/threonine-protein kinase (PIM1) Serine/threonine-protein kinase PIM1 | Serine/threonine-protein kinase pim-1 (PIM1)
Type:
Protein
Mol. Mass.:
35681.82
Organism:
Homo sapiens (Human)
Description:
P11309
Residue:
313
  
Inhibitor
Name:
BDBM50434650
Synonyms:
CHEMBL2387469
Type:
Small organic molecule
Emp. Form.:
C22H19N7O
Mol. Mass.:
397.4326
SMILES:
O=C(Nc1c[nH]c2ncccc12)c1cnn2ccc(NCCc3ccccc3)nc12
: