Target
Prostaglandin E synthase
Ligand
BDBM50434669
Substrate
Meas. Tech.
ChEMBL_961192 (CHEMBL2389928)
IC50
3.3±n/a nM
Citation
 Shiro, TKakiguchi, KTakahashi, HNagata, HTobe, M 7-Phenyl-imidazoquinolin-4(5H)-one derivatives as selective and orally available mPGES-1 inhibitors. Bioorg Med Chem 21:2868-78 (2013)  
Target
Name:
Prostaglandin E synthase
Synonyms:
MGST1L1 PGES PTGES Prostaglandin E synthase (PGES-1) Prostaglandin E synthase-1 (PGES-1) Prostaglandin E2 synthase-1 ( mPGES-1)
Type:
Protein
Mol. Mass.:
17112.22
Organism:
Homo sapiens (Human)
Description:
Residue:
152
  
Inhibitor
Name:
BDBM50434669
Synonyms:
CHEMBL2387588
Type:
Small organic molecule
Emp. Form.:
C22H12Cl2FN3O
Mol. Mass.:
424.255
SMILES:
Fc1cccc(Cl)c1-c1nc2c([nH]1)c(=O)[nH]c1cc(ccc21)-c1ccc(Cl)cc1
: