Target
Prostaglandin E synthase
Ligand
BDBM50434672
Substrate
Meas. Tech.
ChEMBL_961192 (CHEMBL2389928)
IC50
8.3±n/a nM
Citation
 Shiro, TKakiguchi, KTakahashi, HNagata, HTobe, M 7-Phenyl-imidazoquinolin-4(5H)-one derivatives as selective and orally available mPGES-1 inhibitors. Bioorg Med Chem 21:2868-78 (2013)  
Target
Name:
Prostaglandin E synthase
Synonyms:
MGST1L1 PGES PTGES Prostaglandin E synthase (PGES-1) Prostaglandin E synthase-1 (PGES-1) Prostaglandin E2 synthase-1 ( mPGES-1)
Type:
Protein
Mol. Mass.:
17112.22
Organism:
Homo sapiens (Human)
Description:
Residue:
152
  
Inhibitor
Name:
BDBM50434672
Synonyms:
CHEMBL2387506
Type:
Small organic molecule
Emp. Form.:
C23H15ClFN3O
Mol. Mass.:
403.836
SMILES:
Cc1ccc(cc1)-c1ccc2c3nc([nH]c3c(=O)[nH]c2c1)-c1c(F)cccc1Cl
: