Target
Activin receptor type-1
Ligand
BDBM50262685
Substrate
Meas. Tech.
ChEMBL_961933 (CHEMBL2390524)
IC50
68±n/a nM
Citation
 Engers, DWFrist, AYLindsley, CWHong, CCHopkins, CR Synthesis and structure-activity relationships of a novel and selective bone morphogenetic protein receptor (BMP) inhibitor derived from the pyrazolo[1.5-a]pyrimidine scaffold of dorsomorphin: the discovery of ML347 as an ALK2 versus ALK3 selective MLPCN probe. Bioorg Med Chem Lett 23:3248-52 (2013)  
Target
Name:
Activin receptor type-1
Synonyms:
2.7.11.30 ACVR1 ACVRLK2 ALK2/ACVR1 Activin receptor-like kinase 2 Activin receptor-like kinase 2 (ALK2/ACVR1) SKR1 TGF-B superfamily receptor type I | TSR-I
Type:
Mol. Mass.:
57158.32
Organism:
Homo sapiens (Human)
Description:
Residue:
509
  
Inhibitor
Name:
BDBM50262685
Synonyms:
6-(4-(2-(piperidin-1-yl)ethoxy)phenyl)-3-(pyridin-4-yl)pyrazolo[1,5-a]pyrimidine CHEMBL478629 US9040694, Dorsomorphin
Type:
Small organic molecule
Emp. Form.:
C24H25N5O
Mol. Mass.:
399.4882
SMILES:
C(CN1CCCCC1)Oc1ccc(cc1)-c1cnc2c(cnn2c1)-c1ccncc1
: