Target
Activin receptor type-1
Ligand
BDBM50262016
Substrate
Meas. Tech.
ChEMBL_961933 (CHEMBL2390524)
IC50
33±n/a nM
Citation
 Engers, DWFrist, AYLindsley, CWHong, CCHopkins, CR Synthesis and structure-activity relationships of a novel and selective bone morphogenetic protein receptor (BMP) inhibitor derived from the pyrazolo[1.5-a]pyrimidine scaffold of dorsomorphin: the discovery of ML347 as an ALK2 versus ALK3 selective MLPCN probe. Bioorg Med Chem Lett 23:3248-52 (2013)  
Target
Name:
Activin receptor type-1
Synonyms:
2.7.11.30 ACVR1 ACVRLK2 ALK2/ACVR1 Activin receptor-like kinase 2 Activin receptor-like kinase 2 (ALK2/ACVR1) SKR1 TGF-B superfamily receptor type I | TSR-I
Type:
Mol. Mass.:
57158.32
Organism:
Homo sapiens (Human)
Description:
Residue:
509
  
Inhibitor
Name:
BDBM50262016
Synonyms:
4-(6-(4-methoxyphenyl)pyrazolo[1,5-a]pyrimidin-3-yl)quinoline | CHEMBL511563
Type:
Small organic molecule
Emp. Form.:
C22H16N4O
Mol. Mass.:
352.3886
SMILES:
COc1ccc(cc1)-c1cnc2c(cnn2c1)-c1ccnc2ccccc12
: