Target
TGF-beta receptor type-2
Ligand
BDBM102618
Substrate
Meas. Tech.
ChEMBL_961927 (CHEMBL2390518)
IC50
327±n/a nM
Citation
 Engers, DWFrist, AYLindsley, CWHong, CCHopkins, CR Synthesis and structure-activity relationships of a novel and selective bone morphogenetic protein receptor (BMP) inhibitor derived from the pyrazolo[1.5-a]pyrimidine scaffold of dorsomorphin: the discovery of ML347 as an ALK2 versus ALK3 selective MLPCN probe. Bioorg Med Chem Lett 23:3248-52 (2013)  
Target
Name:
TGF-beta receptor type-2
Synonyms:
TGF-beta receptor type II TGFR2_HUMAN
Type:
PROTEIN
Mol. Mass.:
64559.49
Organism:
Homo sapiens (Human)
Description:
ChEMBL_586859
Residue:
567
  
Inhibitor
Name:
BDBM102618
Synonyms:
LDN-212854
Type:
Small organic molecule
Emp. Form.:
C25H22N6
Mol. Mass.:
406.4824
SMILES:
C1CN(CCN1)c1ccc(cc1)-c1cnc2c(cnn2c1)-c1cccc2ncccc12
: