Target
Proteasome subunit beta type-1
Ligand
BDBM50434763
Substrate
Meas. Tech.
ChEMBL_962204 (CHEMBL2388792)
Ki
1550±n/a nM
Citation
 Micale, NEttari, RLavecchia, ADi Giovanni, CScarbaci, KTroiano, VGrasso, SNovellino, ESchirmeister, TZappalà, M Development of peptidomimetic boronates as proteasome inhibitors. Eur J Med Chem 64:23-34 (2013)  
Target
Name:
Proteasome subunit beta type-1
Synonyms:
PSB1_HUMAN PSMB1 Proteasome subunit beta type-1/beta type-5
Type:
PROTEIN
Mol. Mass.:
26493.62
Organism:
Homo sapiens (Human)
Description:
ChEMBL_1366691
Residue:
241
  
Inhibitor
Name:
BDBM50434763
Synonyms:
CHEMBL2385817
Type:
Small organic molecule
Emp. Form.:
C15H20BN3O4
Mol. Mass.:
317.148
SMILES:
CC(C)C[C@H](NC(=O)Cn1ccc2ncccc2c1=O)B(O)O
: