Target
Cytochrome P450 2C19
Ligand
BDBM50434797
Substrate
Meas. Tech.
ChEMBL_962445 (CHEMBL2390191)
IC50
>10000±n/a nM
Citation
 Zak, MHurley, CAWard, SIBergeron, PBarrett, KBalazs, MBlair, WSBull, RChakravarty, PChang, CCrackett, PDeshmukh, GDeVoss, JDragovich, PSEigenbrot, CEllwood, CGaines, SGhilardi, NGibbons, PGradl, SGribling, PHamman, CHarstad, EHewitt, PJohnson, AJohnson, TKenny, JRKoehler, MFBir Kohli, PLabadie, SLee, WPLiao, JLiimatta, MMendonca, RNarukulla, RPulk, RReeve, ASavage, SShia, SSteffek, MUbhayakar, Svan Abbema, AAliagas, IAvitabile-Woo, BXiao, YYang, JKulagowski, JJ Identification of C-2 hydroxyethyl imidazopyrrolopyridines as potent JAK1 inhibitors with favorable physicochemical properties and high selectivity over JAK2. J Med Chem 56:4764-85 (2013)  
Target
Name:
Cytochrome P450 2C19
Synonyms:
CP2CJ_HUMAN CYPIIC17 Cytochrome P450 2C19 (CYP2C19) Mephenytoin 4-hydroxylase P450-254C
Type:
Enzyme
Mol. Mass.:
55935.47
Organism:
Homo sapiens (Human)
Description:
P33261
Residue:
490
  
Inhibitor
Name:
BDBM50434797
Synonyms:
CHEMBL2386653
Type:
Small organic molecule
Emp. Form.:
C15H18N4O2
Mol. Mass.:
286.329
SMILES:
C[C@@H](O)c1nc2cnc3[nH]ccc3c2n1[C@H]1CCCOC1
: