Target
N-arachidonyl glycine receptor
Ligand
BDBM50398219
Substrate
Meas. Tech.
ChEMBL_963378 (CHEMBL2388875)
IC50
>10000±n/a nM
Citation
 Rempel, VVolz, NGläser, FNieger, MBräse, SMüller, CE Antagonists for the orphan G-protein-coupled receptor GPR55 based on a coumarin scaffold. J Med Chem 56:4798-810 (2013)  
Target
Name:
N-arachidonyl glycine receptor
Synonyms:
G-protein coupled receptor 18 GPR18 NAGly receptor
Type:
PROTEIN
Mol. Mass.:
38150.44
Organism:
Homo sapiens (Human)
Description:
ChEMBL_107601
Residue:
331
  
Inhibitor
Name:
BDBM50398219
Synonyms:
CHEMBL2181541
Type:
Small organic molecule
Emp. Form.:
C28H36O4
Mol. Mass.:
436.583
SMILES:
CCCCCCCC(C)(C)c1cc(OC)c2cc(Cc3ccccc3OC)c(=O)oc2c1
: