Target
Transient receptor potential cation channel subfamily V member 1
Ligand
BDBM50434914
Substrate
Meas. Tech.
ChEMBL_960514 (CHEMBL2389489)
Ki
1.1±n/a nM
Citation
 Thorat, SAKang, DWRyu, HKim, MSKim, HSAnn, JHa, TKim, SESon, KChoi, SBlumberg, PMFrank, RBahrenberg, GSchiene, KChristoph, TLee, J 2-(3-Fluoro-4-methylsulfonylaminophenyl)propanamides as potent TRPV1 antagonists: structure activity relationships of the 2-oxy pyridine C-region. Eur J Med Chem 64:589-602 (2013)  
Target
Name:
Transient receptor potential cation channel subfamily V member 1
Synonyms:
Capsaicin receptor Osm-9-like TRP channel 1 TRPV1_HUMAN Transient receptor potential cation channel subfamily V member 1 (TRPV1) Transient receptor potential cation channel subfamily V member 1(TRPV1) Vanilloid VR1 Vanilloid receptor 1 Vanilloid receptor 1 (VRI/TRPV1)
Type:
Protein
Mol. Mass.:
94960.75
Organism:
Homo sapiens (Human)
Description:
Q8NER1
Residue:
839
  
Inhibitor
Name:
BDBM50434914
Synonyms:
CHEMBL2385082
Type:
Small organic molecule
Emp. Form.:
C21H23F4N3O4S
Mol. Mass.:
489.484
SMILES:
CC(C(=O)NCc1ccc(nc1OCC1CC1)C(F)(F)F)c1ccc(NS(C)(=O)=O)c(F)c1
: