Target
P2Y purinoceptor 11
Ligand
BDBM50435011
Substrate
Meas. Tech.
ChEMBL_963120 (CHEMBL2390599)
EC50
3680±n/a nM
Citation
 Azran, SFörster, DDanino, ONadel, YReiser, GFischer, B Highly efficient biocompatible neuroprotectants with dual activity as antioxidants and P2Y receptor agonists. J Med Chem 56:4938-52 (2013)  
Target
Name:
P2Y purinoceptor 11
Synonyms:
P2RY11 P2Y11 Purinergic receptor P2Y11
Type:
PROTEIN
Mol. Mass.:
40366.02
Organism:
Homo sapiens (Human)
Description:
ChEMBL_1362532
Residue:
374
  
Inhibitor
Name:
BDBM50435011
Synonyms:
CHEMBL2386491
Type:
Small organic molecule
Emp. Form.:
C10H16BClN5O9P2
Mol. Mass.:
458.474
SMILES:
[BH3-][P@@](=O)(OC[C@H]1O[C@H]([C@H](O)[C@@H]1O)n1cnc2c(N)nc(Cl)nc12)OP(O)(O)=O
: