Target
Oxytocin receptor
Ligand
BDBM50435057
Substrate
Meas. Tech.
ChEMBL_964690 (CHEMBL2394482)
IC50
9.2±n/a nM
Citation
 Smith, ALFreeman, SMVoll, RJYoung, LJGoodman, MM Carbon-11 N-methyl alkylation of L-368,899 and in vivo PET imaging investigations for neural oxytocin receptors. Bioorg Med Chem Lett 23:902-6 (2013)  
Target
Name:
Oxytocin receptor
Synonyms:
OT-R Otr Oxytocin
Type:
Enzyme Catalytic Domain
Mol. Mass.:
42889.28
Organism:
RAT
Description:
Oxytocin OXTR RAT::P70536
Residue:
388
  
Inhibitor
Name:
BDBM50435057
Synonyms:
CHEMBL2391300
Type:
Small organic molecule
Emp. Form.:
C27H44N4O5S2
Mol. Mass.:
568.792
SMILES:
CN[C@@H](CCS(C)(=O)=O)C(=O)N[C@H]1C[C@H]2CC[C@]1(CS(=O)(=O)N1CCN(CC1)c1ccccc1C)C2(C)C
: