Target
Integrin alpha-4/beta-1
Ligand
BDBM50435067
Substrate
Meas. Tech.
ChEMBL_964732 (CHEMBL2394665)
IC50
890±n/a nM
Citation
 Soni, ARehman, ANaik, KDastidar, SAlam, MSRay, AChaira, TShah, VPalle, VPCliffe, IASattigeri, VJ Synthesis and evaluation of 4,5-dihydro-5-methylisoxazolin-5-carboxamide derivatives as VLA-4 antagonists. Bioorg Med Chem Lett 23:1482-5 (2013)  
Target
Name:
Integrin alpha-4/beta-1
Synonyms:
Fibronectin receptor beta/Integrin alpha-4 | Integrin alpha-4/beta-1
Type:
Mol. Mass.:
Description:
ASSAY_ID of EBI is 88912
Components:
This complex has 2 components.
Component 1
Name:
Integrin beta-1
Synonyms:
CD_antigen=CD29 Fibronectin receptor beta GPIIA ITGB1 MDF2 | MSK12
Type:
Enzyme
Mol. Mass.:
88400.38
Organism:
Homo sapiens (Human)
Description:
P05556
Residue:
798
  
Component 2
Name:
Integrin alpha-4
Synonyms:
CD49 antigen-like family member D CD49d antigen ITA4_HUMAN Integrin alpha-4 Integrin alpha-IV VLA-4 integrin alpha 4 precursor | integrin alpha-4 precursor
Type:
Membrane Protein
Mol. Mass.:
114897.35
Organism:
Homo sapiens (Human)
Description:
P13612
Residue:
1032
  
Inhibitor
Name:
BDBM50435067
Synonyms:
CHEMBL2391312
Type:
Small organic molecule
Emp. Form.:
C25H21Cl2N3O5S
Mol. Mass.:
546.422
SMILES:
CC1(CC(=NO1)c1cccs1)C(=O)N[C@@H](Cc1ccc(NC(=O)c2c(Cl)cccc2Cl)cc1)C(O)=O
: