Target
Microtubule-associated protein 2
Ligand
BDBM50433375
Substrate
Meas. Tech.
ChEMBL_963502 (CHEMBL2394383)
IC50
9000±n/a nM
Citation
 Zhang, PYang, XZhang, FGabelli, SBWang, RZhang, YBhat, SChen, XFurlani, MAmzel, LMLiu, JOMa, D Pyridinylpyrimidines selectively inhibit human methionine aminopeptidase-1. Bioorg Med Chem 21:2600-17 (2013)  
Target
Name:
Microtubule-associated protein 2
Synonyms:
MAP-2 MTAP2_HUMAN
Type:
PROTEIN
Mol. Mass.:
199423.64
Organism:
Homo sapiens (Human)
Description:
ChEMBL_107603
Residue:
1827
  
Inhibitor
Name:
BDBM50433375
Synonyms:
CHEMBL472879 | GNF-Pf-359
Type:
Small organic molecule
Emp. Form.:
C18H17ClN4
Mol. Mass.:
324.807
SMILES:
Cc1nc(nc(NCCc2ccccc2)c1Cl)-c1ccccn1
: