Target
Acetylcholinesterase
Ligand
BDBM50435270
Substrate
Meas. Tech.
ChEMBL_963636 (CHEMBL2395155)
IC50
0.495000±n/a nM
Citation
 Eckroat, TJGreen, KDReed, RABornstein, JJGarneau-Tsodikova, S Investigation of the role of linker moieties in bifunctional tacrine hybrids. Bioorg Med Chem 21:3614-23 (2013)  
Target
Name:
Acetylcholinesterase
Synonyms:
ACES_ELEEL Acetylcholinesterase (EeAChE) | ache
Type:
Enzyme
Mol. Mass.:
71812.79
Organism:
Electrophorus electricus (Electric eel)
Description:
Residue:
633
  
Inhibitor
Name:
BDBM50435270
Synonyms:
CHEMBL2393227
Type:
Small organic molecule
Emp. Form.:
C36H43ClN4O
Mol. Mass.:
583.206
SMILES:
Cc1cccc(Nc2ccccc2C(=O)NCCCCCCCCNc2c3CCCCc3nc3cc(Cl)ccc23)c1C
: