Target
Dual specificity tyrosine-phosphorylation-regulated kinase 1B
Ligand
BDBM50435441
Substrate
Meas. Tech.
ChEMBL_965910 (CHEMBL2394341)
IC50
18±n/a nM
Citation
 Coombs, TCTanega, CShen, MWang, JLAuld, DSGerritz, SWSchoenen, FJThomas, CJAubé, J Small-molecule pyrimidine inhibitors of the cdc2-like (Clk) and dual specificity tyrosine phosphorylation-regulated (Dyrk) kinases: development of chemical probe ML315. Bioorg Med Chem Lett 23:3654-61 (2013)  
Target
Name:
Dual specificity tyrosine-phosphorylation-regulated kinase 1B
Synonyms:
DYR1B_HUMAN Dual specificity tyrosine-phosphorylation-regulated kinase 1B MIRK
Type:
Enzyme
Mol. Mass.:
69222.24
Organism:
Homo sapiens (Human)
Description:
Q9Y463
Residue:
629
  
Inhibitor
Name:
BDBM50435441
Synonyms:
CHEMBL1868723
Type:
Small organic molecule
Emp. Form.:
C18H12F3N3O2
Mol. Mass.:
359.302
SMILES:
FC(F)(F)c1cccc(Nc2nccc(n2)-c2ccc3OCOc3c2)c1
: