Target
Dual specificity protein kinase CLK4
Ligand
BDBM50435488
Substrate
Meas. Tech.
ChEMBL_965916 (CHEMBL2394347)
IC50
30±n/a nM
Citation
 Coombs, TCTanega, CShen, MWang, JLAuld, DSGerritz, SWSchoenen, FJThomas, CJAubé, J Small-molecule pyrimidine inhibitors of the cdc2-like (Clk) and dual specificity tyrosine phosphorylation-regulated (Dyrk) kinases: development of chemical probe ML315. Bioorg Med Chem Lett 23:3654-61 (2013)  
Target
Name:
Dual specificity protein kinase CLK4
Synonyms:
CDC-like kinase 4 CLK4_HUMAN | Dual specificity protein kinase CLK1/CLK4
Type:
Serine/threonine-protein kinase
Mol. Mass.:
57522.53
Organism:
Homo sapiens (Human)
Description:
gi_10190706
Residue:
481
  
Inhibitor
Name:
BDBM50435488
Synonyms:
CHEMBL1892019
Type:
Small organic molecule
Emp. Form.:
C18H13Cl2N5
Mol. Mass.:
370.235
SMILES:
Clc1ccc(CNc2nccc(n2)-c2ccc3[nH]ncc3c2)cc1Cl
: