Target
Tyrosine-protein kinase JAK1
Ligand
BDBM50435526
Substrate
Meas. Tech.
ChEMBL_966072 (CHEMBL2395113)
Ki
1.5±n/a nM
Citation
 Hurley, CABlair, WSBull, RJChang, CCrackett, PHDeshmukh, GDyke, HJFong, RGhilardi, NGibbons, PHewitt, PRJohnson, AJohnson, TKenny, JRKohli, PBKulagowski, JJLiimatta, MLupardus, PJMaxey, RJMendonca, RNarukulla, RPulk, RUbhayakar, Svan Abbema, AWard, SIWaszkowycz, BZak, M Novel triazolo-pyrrolopyridines as inhibitors of Janus kinase 1. Bioorg Med Chem Lett 23:3592-8 (2013)  
Target
Name:
Tyrosine-protein kinase JAK1
Synonyms:
JAK-1 JAK1A JAK1_HUMAN Janus kinase 1 (JAK1) | Janus kinase 1 JAK1
Type:
Protein
Mol. Mass.:
133293.73
Organism:
Homo sapiens (Human)
Description:
P23458
Residue:
1154
  
Inhibitor
Name:
BDBM50435526
Synonyms:
CHEMBL2392500
Type:
Small organic molecule
Emp. Form.:
C15H15N7O
Mol. Mass.:
309.3259
SMILES:
O=C(CC#N)N1CCC[C@H](C1)n1nnc2cnc3[nH]ccc3c12
: