Target
C-C chemokine receptor type 1
Ligand
BDBM50430274
Substrate
Meas. Tech.
ChEMBL_964990 (CHEMBL2396023)
IC50
0.360000±n/a nM
Citation
 Hossain, NIvanova, SBergare, JMensonides-Harsema, MCooper, ME Design, synthesis and structure activity relationships of spirocyclic compounds as potent CCR1 antagonists. Bioorg Med Chem Lett 23:3500-4 (2013)  
Target
Name:
C-C chemokine receptor type 1
Synonyms:
C-C CKR-1 CC-CKR-1 CCR1 CD_antigen=CD191 CMKR1 LD78 receptor Macrophage inflammatory protein 1-alpha receptor SCYAR1
Type:
Enzyme
Mol. Mass.:
41180.69
Organism:
Homo sapiens (Human)
Description:
P32246
Residue:
355
  
Inhibitor
Name:
BDBM50430274
Synonyms:
CHEMBL2332935
Type:
Small organic molecule
Emp. Form.:
C23H27ClN2O5
Mol. Mass.:
446.924
SMILES:
CC(=O)Nc1ccc(O)cc1OC[C@@H](O)CN1CCC2(Cc3cc(Cl)ccc3O2)CC1
: