Target
11-beta-hydroxysteroid dehydrogenase 1
Ligand
BDBM50435691
Substrate
Meas. Tech.
ChEMBL_965016 (CHEMBL2396178)
Ki
7.0±n/a nM
Citation
 Bauman, DRWhitehead, AContino, LCCui, JGarcia-Calvo, MGu, XKevin, NMa, XPai, LYShah, KShen, XStribling, SZokian, HJMetzger, JShevell, DEWaddell, ST Evaluation of selective inhibitors of 11ß-HSD1 for the treatment of hypertension. Bioorg Med Chem Lett 23:3650-3 (2013)  
Target
Name:
11-beta-hydroxysteroid dehydrogenase 1
Synonyms:
11-DH 11-beta-Hydroxysteroid Dehydrogenase 1 (11-beta-HSD1) Corticosteroid 11-beta-dehydrogenase isozyme 1 DHI1_RAT Hsd11b1
Type:
Enzyme
Mol. Mass.:
31889.48
Organism:
Rattus norvegicus (rat)
Description:
P16232
Residue:
288
  
Inhibitor
Name:
BDBM50435691
Synonyms:
CHEMBL2391968
Type:
Small organic molecule
Emp. Form.:
C22H22F5N5O
Mol. Mass.:
467.435
SMILES:
Cn1c(nnc1C12CCC(CC1)(CC2)c1noc(n1)C(C)(F)F)-c1ccccc1C(F)(F)F
: