Target
Thioredoxin reductase
Ligand
BDBM50435854
Substrate
Meas. Tech.
ChEMBL_963748 (CHEMBL2395747)
IC50
15000±n/a nM
Citation
 Koch, OJäger, THeller, KKhandavalli, PCPretzel, JBecker, KFlohé, LSelzer, PM Identification of M. tuberculosis thioredoxin reductase inhibitors based on high-throughput docking using constraints. J Med Chem 56:4849-59 (2013)  
Target
Name:
Thioredoxin reductase
Synonyms:
MT4032 TRXB_MYCTU trxB2 | trxR
Type:
PROTEIN
Mol. Mass.:
35636.06
Organism:
Mycobacterium tuberculosis
Description:
ChEMBL_107604
Residue:
335
  
Inhibitor
Name:
BDBM50435854
Synonyms:
CHEMBL2393583
Type:
Small organic molecule
Emp. Form.:
C25H30N4O
Mol. Mass.:
402.5319
SMILES:
CC(N1CCC(CCC(=O)Nc2ccccc2)CC1)c1c[nH]nc1-c1ccccc1
: