Target
Glutamate receptor ionotropic, NMDA 1/2C
Ligand
BDBM50436073
Substrate
Meas. Tech.
ChEMBL_968984 (CHEMBL2400425)
EC50
2900±n/a nM
Citation
 Santangelo Freel, RMOgden, KKStrong, KLKhatri, AChepiga, KMJensen, HSTraynelis, SFLiotta, DC Synthesis and structure activity relationship of tetrahydroisoquinoline-based potentiators of GluN2C and GluN2D containing N-methyl-D-aspartate receptors. J Med Chem 56:5351-81 (2014)  
Target
Name:
Glutamate receptor ionotropic, NMDA 1/2C
Synonyms:
Glutamate NMDA receptor; Grin1/Grin2c | Glutamate [NMDA] receptor subunit epsilon 3/zeta 1
Type:
Mol. Mass.:
Description:
ASSAY_ID of EBI is 141029
Components:
This complex has 2 components.
Component 1
Name:
Glutamate receptor ionotropic, NMDA 1
Synonyms:
Glutamate (NMDA) receptor subunit zeta 1 Glutamate-NMDA-Channel Glutamate-NMDA-Polyamine NMDA Nmdar1 | phencyclidine
Type:
Enzyme Catalytic Domain
Mol. Mass.:
105533.40
Organism:
RAT
Description:
P35439
Residue:
938
  
Component 2
Name:
Glutamate receptor ionotropic, NMDA 2C
Synonyms:
Glutamate NMDA receptor; Grin1/Grin2c Grin2c NMDE3_RAT
Type:
Protein
Mol. Mass.:
135305.94
Organism:
Rattus norvegicus (Rat)
Description:
Q00961
Residue:
1237
  
Inhibitor
Name:
BDBM50436073
Synonyms:
CHEMBL2397210
Type:
Small organic molecule
Emp. Form.:
C32H31NO5
Mol. Mass.:
509.5922
SMILES:
COc1ccc(OCC2N(CCc3cc(OC)c(OC)cc23)C(=O)c2cccc(c2)-c2ccccc2)cc1
: