Target
Glutamate receptor ionotropic, NMDA 1/2D
Ligand
BDBM50436103
Substrate
Meas. Tech.
ChEMBL_968983 (CHEMBL2400424)
EC50
5700±n/a nM
Citation
 Santangelo Freel, RMOgden, KKStrong, KLKhatri, AChepiga, KMJensen, HSTraynelis, SFLiotta, DC Synthesis and structure activity relationship of tetrahydroisoquinoline-based potentiators of GluN2C and GluN2D containing N-methyl-D-aspartate receptors. J Med Chem 56:5351-81 (2014)  
Target
Name:
Glutamate receptor ionotropic, NMDA 1/2D
Synonyms:
Ionotropic glutamate receptor NMDA 1/2D
Type:
Mol. Mass.:
Description:
ASSAY_ID of ChEMBL is 968983
Components:
This complex has 2 components.
Component 1
Name:
Glutamate receptor ionotropic, NMDA 1
Synonyms:
Glutamate (NMDA) receptor subunit zeta 1 Glutamate-NMDA-Channel Glutamate-NMDA-Polyamine NMDA Nmdar1 | phencyclidine
Type:
Enzyme Catalytic Domain
Mol. Mass.:
105533.40
Organism:
RAT
Description:
P35439
Residue:
938
  
Component 2
Name:
Glutamate receptor ionotropic, NMDA 2D
Synonyms:
GluN2D Grin2d NMDAR2D | NMDE4_RAT
Type:
Protein
Mol. Mass.:
143129.52
Organism:
Rattus norvegicus (Rat)
Description:
Q62645
Residue:
1323
  
Inhibitor
Name:
BDBM50436103
Synonyms:
CHEMBL2397255
Type:
Small organic molecule
Emp. Form.:
C25H25NO4
Mol. Mass.:
403.4703
SMILES:
COc1ccc(OCC2N(CCc3cc(OC)ccc23)C(=O)c2ccccc2)cc1
: