Target
Calcitonin gene-related peptide type 1 receptor
Ligand
BDBM50268484
Substrate
Meas. Tech.
ChEMBL_969057 (CHEMBL2400791)
Ki
0.013000±n/a nM
Citation
 Chaturvedula, PVMercer, SEPin, SSThalody, GXu, CConway, CMKeavy, DSignor, LCantor, GHMathias, NMoench, PDenton, RMacci, RSchartman, RWhiterock, VDavis, CMacor, JEDubowchik, GM Discovery of (R)-N-(3-(7-methyl-1H-indazol-5-yl)-1-(4-(1-methylpiperidin-4-yl)-1-oxopropan-2-yl)-4-(2-oxo-1,2-dihydroquinolin-3-yl)piperidine-1-carboxamide (BMS-742413): a potent human CGRP antagonist with superior safety profile for the treatment of migraine through intranasal delivery. Bioorg Med Chem Lett 23:3157-61 (2013)  
Target
Name:
Calcitonin gene-related peptide type 1 receptor
Synonyms:
Adrenomedullin receptor AM1; CALCRL/RAMP2 CALRL_HUMAN CGRP type 1 receptor mRNA Calcitonin gene-related peptide (CGRP) receptor Calcitonin receptor-like receptor Human CL receptor
Type:
Enzyme Catalytic Domain
Mol. Mass.:
52980.45
Organism:
Homo sapiens (Human)
Description:
Q16602
Residue:
461
  
Inhibitor
Name:
BDBM50268484
Synonyms:
(R)-4-(8-Fluoro-2-oxo-1,2-dihydroquinazolin-3(4H)-yl)-N-(3-(7-methyl-1H-indazol-5-yl)-1-oxo-1-(4-(piperidin-1-yl)piperidin-1-yl)propan-2-yl)piperidine-1-carboxamide BMS-694153 | CHEMBL450668
Type:
Small organic molecule
Emp. Form.:
C35H45FN8O3
Mol. Mass.:
644.782
SMILES:
Cc1cc(C[C@@H](NC(=O)N2CCC(CC2)N2Cc3cccc(F)c3NC2=O)C(=O)N2CCC(CC2)N2CCCCC2)cc2cn[nH]c12
: