Target
D-amino-acid oxidase
Ligand
BDBM50031467
Substrate
Meas. Tech.
ChEMBL_968274 (CHEMBL2399755)
Ki
21000±n/a nM
Citation
 Raje, MHin, NDuvall, BFerraris, DVBerry, JFThomas, AGAlt, JRojas, CSlusher, BSTsukamoto, T Synthesis of kojic acid derivatives as secondary binding site probes of D-amino acid oxidase. Bioorg Med Chem Lett 23:3910-3 (2013)  
Target
Name:
D-amino-acid oxidase
Synonyms:
D-Amino Acid Oxidase (DAAO) DAMOX OXDA_PIG
Type:
Flavoprotein
Mol. Mass.:
39338.01
Organism:
Sus scrofa (pig)
Description:
Homodimer.
Residue:
347
  
Inhibitor
Name:
BDBM50031467
Synonyms:
5-HYDROXY-2-(HYDROXYMETHYL)-4H-PYRAN-4-ONE CHEMBL287556 US10857082, Kojic acid US9682910, kojic acid
Type:
Small organic molecule
Emp. Form.:
C6H6O4
Mol. Mass.:
142.1094
SMILES:
OCc1cc(=O)c(O)co1
: