Target
Nuclear receptor subfamily 1 group I member 2
Ligand
BDBM21282
Substrate
Meas. Tech.
ChEMBL_967641 (CHEMBL2399371)
EC50
2640±n/a nM
Citation
 Yu, DDLin, WChen, TForman, BM Development of time resolved fluorescence resonance energy transfer-based assay for FXR antagonist discovery. Bioorg Med Chem 21:4266-78 (2013)  
Target
Name:
Nuclear receptor subfamily 1 group I member 2
Synonyms:
NR1I2 Orphan nuclear receptor PAR1 PXR SXR nuclear receptor subfamily 1 group I member 2 isoform 1
Type:
Nuclear receptor
Mol. Mass.:
49774.77
Organism:
Homo sapiens (Human)
Description:
O75469
Residue:
434
  
Inhibitor
Name:
BDBM21282
Synonyms:
2-methyl-3-(naphthalen-1-ylcarbonyl)-1-propyl-1H-indole JWH-015
Type:
Emp. Form.:
C23H21NO
Mol. Mass.:
327.4189
SMILES:
CCCn1c(C)c(C(=O)c2cccc3ccccc23)c2ccccc12
: