Target
Presenilin-1
Ligand
BDBM50436211
Substrate
Meas. Tech.
ChEMBL_966382 (CHEMBL2401601)
IC50
39800±n/a nM
Citation
 Naumann, ECGöring, SOgorek, IWeggen, SSchmidt, B Membrane anchoring¿-secretase modulators with terpene-derived moieties. Bioorg Med Chem Lett 23:3852-6 (2013)  
Target
Name:
Presenilin-1
Synonyms:
3.4.23.- Gamma-Secretase Subunit Presenilin-1 PS1 PSEN1 PSNL1 Presenilin-1 CTF12 Protein S182
Type:
Mol. Mass.:
52657.13
Organism:
Homo sapiens (Human)
Description:
P49768
Residue:
467
  
Inhibitor
Name:
BDBM50436211
Synonyms:
CHEMBL2398569
Type:
Small organic molecule
Emp. Form.:
C36H58O6
Mol. Mass.:
586.8421
SMILES:
CC(C)CCC[C@@H](C)CCC[C@@H](C)CCC\C(C)=C\COC(=O)C1(C)CCc2c(C)c(OCC(O)=O)c(C)c(C)c2O1
: