Target
Presenilin-1
Ligand
BDBM50436219
Substrate
Meas. Tech.
ChEMBL_966384 (CHEMBL2398821)
EC50
>100000±n/a nM
Citation
 Naumann, ECGöring, SOgorek, IWeggen, SSchmidt, B Membrane anchoring¿-secretase modulators with terpene-derived moieties. Bioorg Med Chem Lett 23:3852-6 (2013)  
Target
Name:
Presenilin-1
Synonyms:
3.4.23.- Gamma-Secretase Subunit Presenilin-1 PS1 PSEN1 PSNL1 Presenilin-1 CTF12 Protein S182
Type:
Mol. Mass.:
52657.13
Organism:
Homo sapiens (Human)
Description:
P49768
Residue:
467
  
Inhibitor
Name:
BDBM50436219
Synonyms:
CHEMBL2398566
Type:
Small organic molecule
Emp. Form.:
C32H54O4
Mol. Mass.:
502.7688
SMILES:
COC(=O)COc1c(C)c(C)c2OC(C)(CCCC(C)CCCC(C)CCCC(C)C)CCc2c1C
: