Target
Transforming protein RhoA
Ligand
BDBM50436248
Substrate
Meas. Tech.
ChEMBL_966397 (CHEMBL2398834)
IC50
32000±n/a nM
Citation
 Bell, JLHaak, AJWade, SMKirchhoff, PDNeubig, RRLarsen, SD Optimization of novel nipecotic bis(amide) inhibitors of the Rho/MKL1/SRF transcriptional pathway as potential anti-metastasis agents. Bioorg Med Chem Lett 23:3826-32 (2013)  
Target
Name:
Transforming protein RhoA
Synonyms:
ARH12 RHO12 RHOA_HUMAN h12
Type:
PROTEIN
Mol. Mass.:
21766.89
Organism:
Homo sapiens (Human)
Description:
ChEMBL_966397
Residue:
193
  
Inhibitor
Name:
BDBM50436248
Synonyms:
CHEMBL2398708
Type:
Small organic molecule
Emp. Form.:
C22H17F6N3O2
Mol. Mass.:
469.3797
SMILES:
FC(F)(F)c1cc(cc(c1)C(F)(F)F)C(=O)N1CCCC(C1)C(=O)Nc1cccc(c1)C#N
: