Target
Transforming protein RhoA
Ligand
BDBM50436249
Substrate
Meas. Tech.
ChEMBL_966397 (CHEMBL2398834)
IC50
30000±n/a nM
Citation
 Bell, JLHaak, AJWade, SMKirchhoff, PDNeubig, RRLarsen, SD Optimization of novel nipecotic bis(amide) inhibitors of the Rho/MKL1/SRF transcriptional pathway as potential anti-metastasis agents. Bioorg Med Chem Lett 23:3826-32 (2013)  
Target
Name:
Transforming protein RhoA
Synonyms:
ARH12 RHO12 RHOA_HUMAN h12
Type:
PROTEIN
Mol. Mass.:
21766.89
Organism:
Homo sapiens (Human)
Description:
ChEMBL_966397
Residue:
193
  
Inhibitor
Name:
BDBM50436249
Synonyms:
CHEMBL2398707
Type:
Small organic molecule
Emp. Form.:
C22H20F6N2O3
Mol. Mass.:
474.3962
SMILES:
COc1cccc(NC(=O)C2CCCN(C2)C(=O)c2cc(cc(c2)C(F)(F)F)C(F)(F)F)c1
: