Target
C-C chemokine receptor type 1
Ligand
BDBM50436256
Substrate
Meas. Tech.
ChEMBL_966430 (CHEMBL2398867)
IC50
1.000000±n/a nM
Citation
 Gardner, DSSantella, JBDuncia, JVCarter, PHDhar, TGWu, HGuo, WCavallaro, CVan Kirk, KYarde, MBriceno, SWGrafstrom, RRLiu, RPatel, SRTebben, AJCamac, DKhan, JWatson, AYang, GRose, AFoster, WRCvijic, MEDavies, PHynes, J The discovery of BMS-457, a potent and selective CCR1 antagonist. Bioorg Med Chem Lett 23:3833-40 (2013)  
Target
Name:
C-C chemokine receptor type 1
Synonyms:
C-C CKR-1 CC-CKR-1 CCR1 CD_antigen=CD191 CMKR1 LD78 receptor Macrophage inflammatory protein 1-alpha receptor SCYAR1
Type:
Enzyme
Mol. Mass.:
41180.69
Organism:
Homo sapiens (Human)
Description:
P32246
Residue:
355
  
Inhibitor
Name:
BDBM50436256
Synonyms:
CHEMBL2398726
Type:
Small organic molecule
Emp. Form.:
C24H35ClN2O4
Mol. Mass.:
450.999
SMILES:
CC(C)[C@@H](NC(=O)[C@@H]1CC[C@@H](O)C1)C(=O)N1CC[C@](O)(c2ccc(Cl)cc2)C(C)(C)C1
: