Target
Tyrosine-protein phosphatase non-receptor type 22
Ligand
BDBM50436359
Substrate
Meas. Tech.
ChEMBL_966913 (CHEMBL2401204)
IC50
670±n/a nM
Citation
 He, YLiu, SMenon, AStanford, SOppong, EGunawan, AMWu, LWu, DJBarrios, AMBottini, NCato, ACZhang, ZY A potent and selective small-molecule inhibitor for the lymphoid-specific tyrosine phosphatase (LYP), a target associated with autoimmune diseases. J Med Chem 56:4990-5008 (2013)  
Target
Name:
Tyrosine-protein phosphatase non-receptor type 22
Synonyms:
3.1.3.48 LyP Lymphoid phosphatase (Lyp) PEST-domain phosphatase PTPN22 Tyrosine-protein phosphatase non-receptor type 22 (LYP) | tyrosine-protein phosphatase non-receptor type 22 isoform 1
Type:
Mol. Mass.:
91712.31
Organism:
Homo sapiens (Human)
Description:
Q9Y2R2
Residue:
807
  
Inhibitor
Name:
BDBM50436359
Synonyms:
CHEMBL2396724
Type:
Small organic molecule
Emp. Form.:
C33H22Cl3NO6
Mol. Mass.:
634.89
SMILES:
OC(=O)c1cc2c(C#Cc3cccc(Cl)c3)c(oc2cc1O)-c1ccc(OCC(=O)NCCc2ccc(Cl)cc2Cl)cc1
: