Target
Tyrosine-protein phosphatase non-receptor type 22
Ligand
BDBM50425815
Substrate
Meas. Tech.
ChEMBL_966913 (CHEMBL2401204)
IC50
630±n/a nM
Citation
 He, YLiu, SMenon, AStanford, SOppong, EGunawan, AMWu, LWu, DJBarrios, AMBottini, NCato, ACZhang, ZY A potent and selective small-molecule inhibitor for the lymphoid-specific tyrosine phosphatase (LYP), a target associated with autoimmune diseases. J Med Chem 56:4990-5008 (2013)  
Target
Name:
Tyrosine-protein phosphatase non-receptor type 22
Synonyms:
3.1.3.48 LyP Lymphoid phosphatase (Lyp) PEST-domain phosphatase PTPN22 Tyrosine-protein phosphatase non-receptor type 22 (LYP) | tyrosine-protein phosphatase non-receptor type 22 isoform 1
Type:
Mol. Mass.:
91712.31
Organism:
Homo sapiens (Human)
Description:
Q9Y2R2
Residue:
807
  
Inhibitor
Name:
BDBM50425815
Synonyms:
CHEMBL2316908
Type:
Small organic molecule
Emp. Form.:
C29H18O5
Mol. Mass.:
446.4502
SMILES:
OC(=O)c1cc2c(C#Cc3ccc(Oc4ccccc4)cc3)c(oc2cc1O)-c1ccccc1
: