Target
Chymase
Ligand
BDBM100750
Substrate
Meas. Tech.
ChEMBL_967547 (CHEMBL2398941)
IC50
260±n/a nM
Citation
 Tanaka, TSugawara, HMaruoka, HImajo, SMuto, T Discovery of novel series of 6-benzyl substituted 4-aminocarbonyl-1,4-diazepane-2,5-diones as human chymase inhibitors using structure-based drug design. Bioorg Med Chem 21:4233-49 (2013)  
Target
Name:
Chymase
Synonyms:
Alpha-chymase CMA1_HUMAN CYM Mast cell protease I
Type:
Enzyme
Mol. Mass.:
27340.12
Organism:
Homo sapiens (Human)
Description:
Residue:
247
  
Inhibitor
Name:
BDBM100750
Synonyms:
CHEMBL2397003 | US8507714, 239
Type:
Small organic molecule
Emp. Form.:
C19H23ClN8O5
Mol. Mass.:
478.89
SMILES:
CC[C@@H](NC(=O)N1CC(=O)NCC(Cc2cc(Cl)ccc2OC)C1=O)C(=O)Nc1nnn[nH]1
: