Target
Bifunctional epoxide hydrolase 2
Ligand
BDBM50217448
Substrate
Meas. Tech.
ChEMBL_967730 (CHEMBL2399731)
IC50
1.5±n/a nM
Citation
 Hwang, SHWecksler, ATZhang, GMorisseau, CNguyen, LVFu, SHHammock, BD Synthesis and biological evaluation of sorafenib- and regorafenib-like sEH inhibitors. Bioorg Med Chem Lett 23:3732-7 (2013)  
Target
Name:
Bifunctional epoxide hydrolase 2
Synonyms:
Cytosolic epoxide hydrolase 2 EPHX2 HYES_HUMAN Soluble epoxide hydrolase (sEH) | epoxide hydrolase 2, cytoplasmic
Type:
Enzyme
Mol. Mass.:
62613.07
Organism:
Homo sapiens (Human)
Description:
P34913
Residue:
555
  
Inhibitor
Name:
BDBM50217448
Synonyms:
CHEMBL242459 trans-4-[4-(3-adamantan-1-ylureido)cyclohexyloxy]benzoic acid
Type:
Small organic molecule
Emp. Form.:
C24H32N2O4
Mol. Mass.:
412.5219
SMILES:
OC(=O)c1ccc(O[C@H]2CC[C@@H](CC2)NC(=O)NC23CC4CC(CC(C4)C2)C3)cc1
: