Target
Cytochrome P450 3A4
Ligand
BDBM50436448
Substrate
Meas. Tech.
ChEMBL_967911 (CHEMBL2400727)
IC50
>10000±n/a nM
Citation
 Furet, PGuagnano, VFairhurst, RAImbach-Weese, PBruce, IKnapp, MFritsch, CBlasco, FBlanz, JAichholz, RHamon, JFabbro, DCaravatti, G Discovery of NVP-BYL719 a potent and selective phosphatidylinositol-3 kinase alpha inhibitor selected for clinical evaluation. Bioorg Med Chem Lett 23:3741-8 (2013)  
Target
Name:
Cytochrome P450 3A4
Synonyms:
Albendazole monooxygenase CP3A4_HUMAN CYP3A4 CYPIIIA4 Cytochrome P450 3A4 (CYP3A4) Nifedipine oxidase Taurochenodeoxycholate 6-alpha-hydroxylase
Type:
Enzyme
Mol. Mass.:
57349.57
Organism:
Homo sapiens (Human)
Description:
Residue:
503
  
Inhibitor
Name:
BDBM50436448
Synonyms:
CHEMBL2397186
Type:
Small organic molecule
Emp. Form.:
C18H24N6O2S
Mol. Mass.:
388.487
SMILES:
Cc1nc(NC(=O)N2CCC[C@H]2C(N)=O)sc1-c1ccnc(n1)C(C)(C)C
: