Target
D(1A) dopamine receptor
Ligand
BDBM50436541
Substrate
Meas. Tech.
ChEMBL_966822 (CHEMBL2400823)
Ki
190±n/a nM
Citation
 Hiller, CKling, RCHeinemann, FWMeyer, KHübner, HGmeiner, P Functionally selective dopamine D2/D3 receptor agonists comprising an enyne moiety. J Med Chem 56:5130-41 (2013)  
Target
Name:
D(1A) dopamine receptor
Synonyms:
DRD1 Dopamine D1 receptor
Type:
PROTEIN
Mol. Mass.:
49269.92
Organism:
Sus scrofa
Description:
ChEMBL_1460140
Residue:
446
  
Inhibitor
Name:
BDBM50436541
Synonyms:
CHEMBL2396663
Type:
Small organic molecule
Emp. Form.:
C28H34N2O
Mol. Mass.:
414.5824
SMILES:
CCCN(CCCCNC(=O)c1ccc(cc1)-c1ccccc1)[C@H]1CCC(=CC1)C#C
: