Target
Bcl-2-like protein 1
Ligand
BDBM50436677
Substrate
Meas. Tech.
ChEMBL_967619 (CHEMBL2399239)
IC50
17±n/a nM
Citation
 Sleebs, BEKersten, WJKulasegaram, SNikolakopoulos, GHatzis, EMoss, RMParisot, JPYang, HCzabotar, PEFairlie, WDLee, EFAdams, JMChen, Lvan Delft, MFLowes, KNWei, AHuang, DCColman, PMStreet, IPBaell, JBWatson, KLessene, G Discovery of potent and selective benzothiazole hydrazone inhibitors of Bcl-XL. J Med Chem 56:5514-40 (2014)  
Target
Name:
Bcl-2-like protein 1
Synonyms:
Anti-apoptotic Bcl-2 protein Apoptosis regulator Bcl-X BCL2-like 1 isoform 1 BCL2L1 Bcl-2-like protein 1 (Bcl-XL) Bcl-xL/Bcl-2-binding component 3 Bcl2-antagonist of cell death (BAD)
Type:
Mitochondrion membrane; Single-pass membrane protein
Mol. Mass.:
26039.60
Organism:
Homo sapiens (Human)
Description:
Residue:
233
  
Inhibitor
Name:
BDBM50436677
Synonyms:
CHEMBL2398252
Type:
Small organic molecule
Emp. Form.:
C24H20N4O2S
Mol. Mass.:
428.506
SMILES:
CC1CC(=NNc2nc3ccccc3s2)c2cc(ccc2C1)-c1cccc(n1)C(O)=O
: