Target
Enoyl-[acyl-carrier-protein] reductase [NADH]
Ligand
BDBM50436719
Substrate
Meas. Tech.
ChEMBL_966862 (CHEMBL2401006)
IC50
6000±n/a nM
Citation
 Hu, XCompton, JRAbdulhameed, MDMarchand, CLRobertson, KLLeary, DHJadhav, AHershfield, JRWallqvist, AFriedlander, AMLegler, PM 3-substituted indole inhibitors against Francisella tularensis FabI identified by structure-based virtual screening. J Med Chem 56:5275-87 (2014)  
Target
Name:
Enoyl-[acyl-carrier-protein] reductase [NADH]
Synonyms:
fabI
Type:
PROTEIN
Mol. Mass.:
27804.42
Organism:
Francisella tularensis subsp. tularensis (strain SCHU S4 / Schu 4)
Description:
Q5NGQ3
Residue:
260
  
Inhibitor
Name:
BDBM50436719
Synonyms:
CHEMBL2398664
Type:
Small organic molecule
Emp. Form.:
C13H10FNO3
Mol. Mass.:
247.2218
SMILES:
NC(=O)c1ccc(Oc2ccccc2O)c(F)c1
: