Target
E3 ubiquitin-protein ligase XIAP
Ligand
BDBM44359
Substrate
Meas. Tech.
ChEMBL_971508 (CHEMBL2406570)
Ki
>39000±n/a nM
Citation
 Ardecky, RJWelsh, KFinlay, DLee, PSGonzález-López, MGanji, SRRavanan, PMace, PDRiedl, SJVuori, KReed, JCCosford, ND Design, synthesis and evaluation of inhibitor of apoptosis protein (IAP) antagonists that are highly selective for the BIR2 domain of XIAP. Bioorg Med Chem Lett 23:4253-7 (2013)  
Target
Name:
E3 ubiquitin-protein ligase XIAP
Synonyms:
API3 E3 ubiquitin-protein ligase XIAP Inhibitor of apoptosis protein 3 X-linked inhibitor of apoptosis XIAP | XIAP_HUMAN
Type:
Protein
Mol. Mass.:
56685.27
Organism:
Homo sapiens (Human)
Description:
P98170
Residue:
497
  
Inhibitor
Name:
BDBM44359
Synonyms:
(2S)-2-[[(2S)-2-amino-1-oxobutyl]amino]-3-methyl-N-[(2S)-1-(1-naphthalenylamino)-1-oxopropan-2-yl]butanamide;formic acid (2S)-2-[[(2S)-2-aminobutanoyl]amino]-N-[(1S)-2-keto-1-methyl-2-(1-naphthylamino)ethyl]-3-methyl-butyramide;formic acid CHEMBL1624542 cid_44229048
Type:
Small organic molecule
Emp. Form.:
C22H30N4O3
Mol. Mass.:
398.4986
SMILES:
CC[C@H](N)C(=O)N[C@@H](C(C)C)C(=O)N[C@@H](C)C(=O)Nc1cccc2ccccc12
: