Target
E3 ubiquitin-protein ligase XIAP
Ligand
BDBM44328
Substrate
Meas. Tech.
ChEMBL_971508 (CHEMBL2406570)
Ki
39000±n/a nM
Citation
 Ardecky, RJWelsh, KFinlay, DLee, PSGonzález-López, MGanji, SRRavanan, PMace, PDRiedl, SJVuori, KReed, JCCosford, ND Design, synthesis and evaluation of inhibitor of apoptosis protein (IAP) antagonists that are highly selective for the BIR2 domain of XIAP. Bioorg Med Chem Lett 23:4253-7 (2013)  
Target
Name:
E3 ubiquitin-protein ligase XIAP
Synonyms:
API3 E3 ubiquitin-protein ligase XIAP Inhibitor of apoptosis protein 3 X-linked inhibitor of apoptosis XIAP | XIAP_HUMAN
Type:
Protein
Mol. Mass.:
56685.27
Organism:
Homo sapiens (Human)
Description:
P98170
Residue:
497
  
Inhibitor
Name:
BDBM44328
Synonyms:
(2S)-N-[(1S)-4-amino-1-(anilinocarbamoyl)butyl]-3-methyl-2-[[(2S)-2-(methylamino)propanoyl]amino]butyramide;formic acid (2S)-N-[(2S)-5-amino-1-oxo-1-(phenylhydrazo)pentan-2-yl]-3-methyl-2-[[(2S)-2-(methylamino)-1-oxopropyl]amino]butanamide;formic acid CHEMBL1623606 cid_44182249
Type:
Small organic molecule
Emp. Form.:
C20H34N6O3
Mol. Mass.:
406.5224
SMILES:
CN[C@@H](C)C(=O)N[C@@H](C(C)C)C(=O)N[C@@H](CCCN)C(=O)NNc1ccccc1
: