Target
Carbonic anhydrase
Ligand
BDBM26986
Substrate
Meas. Tech.
ChEMBL_972118 (CHEMBL2406401)
Ki
42000000±n/a nM
Citation
 Del Prete, SVullo, DDe Luca, VCarginale, VScozzafava, ASupuran, CTCapasso, C A highly catalytically activeż-carbonic anhydrase from the pathogenic anaerobe Porphyromonas gingivalis and its inhibition profile with anions and small molecules. Bioorg Med Chem Lett 23:4067-71 (2013)  
Target
Name:
Carbonic anhydrase
Synonyms:
CAH_METTT Carbonic anhydrase | Gamma-carbonic anhydrase
Type:
Protein
Mol. Mass.:
26390.56
Organism:
Methanosarcina thermophila
Description:
P40881
Residue:
247
  
Inhibitor
Name:
BDBM26986
Synonyms:
CHEMBL363707 SODIUM BICARBONATE hydrogen carbonate
Type:
Ion
Emp. Form.:
CHO3
Mol. Mass.:
61.0174
SMILES:
OC([O-])=O
: