Target
Carbonic anhydrase
Ligand
BDBM10880
Substrate
Meas. Tech.
ChEMBL_972117 (CHEMBL2406400)
Ki
27±n/a nM
Citation
 Del Prete, SVullo, DDe Luca, VCarginale, VScozzafava, ASupuran, CTCapasso, C A highly catalytically activeż-carbonic anhydrase from the pathogenic anaerobe Porphyromonas gingivalis and its inhibition profile with anions and small molecules. Bioorg Med Chem Lett 23:4067-71 (2013)  
Target
Name:
Carbonic anhydrase
Synonyms:
Beta-carbonic anhydrase Carbonate dehydratase FbiCA1
Type:
Protein
Mol. Mass.:
35543.44
Organism:
Vibrio cholerae
Description:
P46510
Residue:
330
  
Inhibitor
Name:
BDBM10880
Synonyms:
AZA AZM acetazolamide Acetazolamide Acetazolamide (AZA) Acetazolamide, 5 Acetazolamide, AZA CHEMBL20 Sulfonamide, 1 US11278534, Example acetazolamide sulfonamide 1
Type:
Small organic molecule
Emp. Form.:
C4H6N4O3S2
Mol. Mass.:
222.245
SMILES:
CC(=O)Nc1nnc(s1)S(N)(=O)=O
: