Target
Metabotropic glutamate receptor 5
Ligand
BDBM50437082
Substrate
Meas. Tech.
ChEMBL_969988 (CHEMBL2405254)
EC50
3.9±n/a nM
Citation
 Packiarajan, MGrenon, MZorn, SHopper, ATWhite, ADChandrasena, GPu, XBrodbeck, RMRobichaud, AJ Fused thiazolyl alkynes as potent mGlu5 receptor positive allosteric modulators. Bioorg Med Chem Lett 23:4037-43 (2013)  
Target
Name:
Metabotropic glutamate receptor 5
Synonyms:
GPRC1E GRM5_HUMAN metabotropic glutamate 5 | metabotropic glutamate 5a
Type:
Enzyme
Mol. Mass.:
132484.72
Organism:
Homo sapiens (Human)
Description:
Residue:
1212
  
Inhibitor
Name:
BDBM50437082
Synonyms:
CHEMBL2403684
Type:
Small organic molecule
Emp. Form.:
C21H20N2OS
Mol. Mass.:
348.461
SMILES:
O=C(C1CC11CCC1)N1CCc2nc(sc2C1)C#Cc1ccccc1
: